چسب
preferred label: adhesive @en
type: Concept
narrower: چسب آب‌پایه

چسب آب‌پایه
scope note: چسبی که مادۀ چسبندۀ آن در آب حل شده‌ باشد.
broader: چسب
preferred label: water-based adhesive @en
type: Concept