آلیاژ بلوری بی‌نظم
scope note: مخلوطی از دو یا چند عنصر که در آن اتم‌های مخلوط به‌طور کاتوره‌ای در جایگاه‌های شبکۀ بلور قرار می‌گیرند.
broader: آلیاژ
preferred label: disordered crystalline alloy @en
type: Concept

آلیاژ
preferred label: alloy @en
type: Concept
narrower: آلیاژ بلوری بی‌نظم