پروتئین آب‌پنیر
scope note: پروتئینی که بعد از جداسازی دَلَمه و خامه در شیر باقی می‌ماند.
broader: پروتئین
preferred label: whey protein @en
type: Concept

پروتئین
preferred label: protein @en
type: Concept
narrower: پروتئین آب‌پنیر