مواد قیری
preferred label: bituminous materials @en
type: Concept
narrower: قیر خمیری

قیر خمیری
scope note: قیری که با اضافه کردن مواد شیمیایی به‌صورت خمیر درآید.
broader: مواد قیری
preferred label: mastic asphalt @en
type: Concept