چینی شیشه‌ای
alternative label: سرامیک شیشه‌ای
scope note: سرامیک‌افزاری (ceramic ware) لعاب‌دار یا بدونِ لعاب با قدرت جذب آب کمتر از 0/3 درصد که به‌‌دلیل شیشه‌ای ‌شدن کاملاً متراکم است.
narrower: چینی شیشه‌ای بهداشتی
broader: سرامیک‌‌افزار
preferred label: vitreous china @en
type: Concept

چینی شیشه‌ای بهداشتی
preferred label: vitreous china sanitaryware @en
type: Concept
broader: چینی شیشه‌ای

سرامیک‌‌افزار
preferred label: ceramic ware @en
type: Concept
narrower: چینی شیشه‌ای