تنوارساز
scope note: افزودنی خوراکی که تنواری غذا را بهبود می‌دهد.
broader: افزودنی‌های غذایی
preferred label: bodying agent @en
type: Concept

افزودنی‌های غذایی
preferred label: food additives @en
type: Concept
narrower: تنوارساز