ماده حجم‌افزا
alternative label: حجم‌افزا
scope note: مادۀ غیرمغذی که برای افزایش حجم به مواد غذایی افزوده می‌شود.
broader: افزودنی‌های غذایی
preferred label: bulking agent @en
type: Concept

افزودنی‌های غذایی
preferred label: food additives @en
type: Concept
narrower: ماده حجم‌افزا