افزودنی‌های غذایی
preferred label: food additives @en
type: Concept
narrower: ماده عمل‌آور

ماده عمل‌آور
scope note: ماده‌ای که برای عمل‌آوری مواد غذایی به کار می‌رود، مانند نمک طعام، نیترات‌ها، نیتریت‌ها، شکر و ادویه
broader: افزودنی‌های غذایی
preferred label: curing agent @en
type: Concept