افزودنی‌های غذایی
preferred label: food additives @en
type: Concept
narrower: ماده براق‌کننده

ماده براق‌کننده
scope note: ماده‌ای که در فرایند براق‌سازی مواد غذایی به کار می‌رود.
broader: افزودنی‌های غذایی
preferred label: polishing agent @en
type: Concept