عامل
preferred label: agent @en
type: Concept
narrower: عامل تراکم

عامل تراکم
scope note: نوعی ترکیب شیمیایی که به‌عنوان کاتالیزگر به پیشرفت واکنش کمک می‌کند.
related: کاتالیزگر
broader: عامل
preferred label: condensation agent @en
type: Concept

کاتالیزگر
preferred label: catalyst @en
type: Concept
related: عامل تراکم