عامل واسرشتن
scope note: عاملی که خواص پروتئین را در محلول آبی تغییر می‌دهد.
related: پروتئین
broader: عامل
preferred label: denaturing agent @en
type: Concept

پروتئین
preferred label: protein @en
type: Concept
related: عامل واسرشتن

عامل
preferred label: agent @en
type: Concept
narrower: عامل واسرشتن