عامل
preferred label: agent @en
type: Concept
narrower: عامل احیا

لاستیک
preferred label: rubber @en
type: Concept
related: عامل احیا

عامل احیا
scope note: ماده‌ای که برای افزایش سرعت احیای لاستیک در حین فرایند به آن اضافه می‌شود.
related: لاستیک
broader: عامل
preferred label: reclaiming agent @en
type: Concept