عامل
preferred label: agent @en
type: Concept
narrower: عامل سطح‌فعال

عامل سطح‌فعال
alternative label: عاسف
scope note: هر ماده‌ای که از کشش سطحی یا بینِ‌سطحی محیطی که در آن حل شده است بکاهد .
broader: عامل
preferred label: surfactant @en
type: Concept