گیاه
preferred label: plant (botany) @en
type: Concept
related: آفت‌کش تماسی

آفت‌کش
preferred label: pesticide @en
type: Concept
narrower: آفت‌کش تماسی

آفت‌کش تماسی
scope note: نوعی آفت‌کُش که بر روی گیاه پاشیده می‌شود و پس از تماس با آفت آن را از بین می‌برد.
related: گیاه
broader: آفت‌کش
preferred label: contact pesticide @en
type: Concept