گیاه
preferred label: plant (botany) @en
type: Concept
related: آفت‌کش جذبی

آفت‌کش
preferred label: pesticide @en
type: Concept
narrower: آفت‌کش جذبی

آفت‌کش جذبی
scope note: نوعی آفت‌کُش که پس از پاشیده شدن بر روی گیاه وارد جریان شیرۀ آن می‌شود و آفت در نتیجۀ تغذیه از گیاه از بین می‌رود.
related: گیاه
broader: آفت‌کش
preferred label: systemic pesticide @en
type: Concept