رزانه
preferred label: dye @en
type: Concept
narrower: رزانه‌های گوگردی

رزانه‌های گوگردی
scope note: دسته‌ای از رَزانه‌های نامحلول در آب و بر پایۀ گوگرد که به شکل کاهیده و حل‌شده در محلول سدیم‌سولفید بر روی لیف به کار می‌روند و سپس برای بازگشتن به حالت اصلی، تحت اکسایش مجدد قرار می‌گیرند.
broader: رزانه
preferred label: sulphur dye @en
type: Concept