حلال پروتون‌زا
scope note: حلاّلی که به‌عنوان یک اسید ضعیف یا قوی توانایی پروتون‌دهی دارد.
related: اسید
broader: حلال
preferred label: protogenic solvent @en
type: Concept

اسید
preferred label: acid @en
type: Concept
related: حلال پروتون‌زا

حلال
preferred label: solvent @en
type: Concept
narrower: حلال پروتون‌زا