برق‌کاف دوخصلتی
scope note: نوعی برق‌کاف که هم‌زمان دارای خاصیت اسیدی و بازی است.
broader: برق‌کاف
preferred label: ampholyte @en
type: Concept

برق‌کاف
preferred label: electrolyte @en
type: Concept
narrower: برق‌کاف دوخصلتی