کود آلی
scope note: کودی که منشأ گیاهی یا دامی دارد و برای تقویت خاک به کار می‌رود.
broader: کود
preferred label: organic fertilizer @en
type: Concept

کود
preferred label: fertilizer @en
type: Concept
narrower: کود آلی