رنگ‌دانه صدفی
scope note: رنگ‌دانه‌ای با ذرات بلوری و شفاف به شکل صفحات موازی که ظاهری شبیه به صدف به محصول می‌بخشد.
broader: رنگ‌دانه
preferred label: pearlescent pigment @en
type: Concept

رنگ‌دانه
preferred label: pigment @en
type: Concept
narrower: رنگ‌دانه صدفی