بسپار زیست‌چسب
alternative label: بسپار زی‌چسب
scope note: مادۀ بسپاری طبیعی که توانایی اتصال به سطح بافت‌های زنده را دارد .
broader: بسپار
preferred label: bioadhesive polymer @en
type: Concept

بسپار
preferred label: polymer @en
type: Concept
narrower: بسپار زیست‌چسب