پودر
preferred label: powder @en
type: Concept
narrower: پودر شاخه‌ای

پودر شاخه‌ای
scope note: پودری با دانه‌هایی شاخه‌دار، مرکب از یک شاخۀ اصلی و چند شاخۀ فرعی
broader: پودر
preferred label: dendritic powder @en
type: Concept