پودر هیدروژن‌کاهیده
scope note: پودر تولیدشده ازطریق احیای ترکیبات، معمولاً اکسیدها، با هیدروژن
broader: پودر
preferred label: hydrogen reduced powder @en
type: Concept

پودر
preferred label: powder @en
type: Concept
narrower: پودر هیدروژن‌کاهیده