پودر فلز
preferred label: powder metal @en
type: Concept
narrower: پودر آلیاژی

پودر آلیاژی
scope note: پودری فلزی مرکب از حداقل دو جزء که به‌طور نسبی یا کامل با هم آلیاژ شده‌اند.
broader: پودر فلز
preferred label: alloyed powder @en
type: Concept