لاستیک احیا‌شده
alternative label: بازلاستیک
scope note: لاستیک ولکانیده‌ای که با روش‌های مکانیکی یا شیمیایی نرم‌شده و بخشی از آن واولکانیده (devulcanised) شده است.
broader: لاستیک
preferred label: reclaimed rubber @en
type: Concept

لاستیک
preferred label: rubber @en
type: Concept
narrower: لاستیک احیا‌شده