ماسه
preferred label: sand @en
type: Concept
narrower: ماسه دیرگداز

ماسه دیرگداز
scope note: ماسه‌ای مقاوم در برابر حرارت بالا که در ساخت مواد دیرگداز به کار می‌رود.
broader: ماسه
preferred label: refractory sand @en
type: Concept