طیف‌سنجی
preferred label: spectrometry @en
type: Concept
narrower: طیف‌سنجی انرژی جنبشی یون

طیف‌سنجی انرژی جنبشی یون
scope note: نوعی طیف‌شناسی برای تعیین انرژی محصولات یونی که به هنگام عبور باریکه‌ای از یون‌های پرانرژی جنبشی از محفظۀ واکنشِ بی‌‌میدان تولید می‌شود.
broader: طیف‌سنجی
preferred label: ion kinetic energy spectrometry @en
type: Concept