ایزوتوپ
preferred label: isotope @en
type: Concept
related: طیف‌سنجی جرمی شتاب‌دهنده‌

طیف‌سنجی جرمی شتاب‌دهنده‌
scope note: روشی که در آن ایزوتوپ‌ها را با استفاده از یک طیف‌سنج جِرمی دقیق ردیابی می‌کنند.
related: ایزوتوپ
broader: طیف‌سنجی جرمی
preferred label: accelerator mass spectrometry @en
type: Concept

طیف‌سنجی جرمی
preferred label: mass spectrometry @en
type: Concept
narrower: طیف‌سنجی جرمی شتاب‌دهنده‌