طیف‌سنجی
preferred label: spectrometry @en
type: Concept
narrower: طیف‌سنجی پرتو ایکس

طیف‌سنجی پرتو ایکس
scope note: اندازه‌گیری و تحلیل پراش پرتو ایکس تولیدشده از بلورها
related: پرتو ایکس
broader: طیف‌سنجی
preferred label: X-ray spectrometry @en
type: Concept

پرتو ایکس
preferred label: X ray @en
type: Concept
related: طیف‌سنجی پرتو ایکس