شکنندگی
preferred label: brittleness @en
type: Concept
narrower: تردی آبی‌رنگ

فولاد
preferred label: steel @en
type: Concept
related: تردی آبی‌رنگ

تردی آبی‌رنگ
scope note: نوعی تردی در فولادهایی که در دمای بین 200 تا 370 درجۀ سلسیوس بر روی آنها کار مکانیکی انجام شده است.
related: فولاد
broader: شکنندگی
preferred label: blue brittleness @en
type: Concept