میرایی نادوره‌ای
scope note: بیش‌میرایی هر سامانۀ نوسان‌کننده که در آن، سامانه بی‌آنکه حول نقطۀ تعادل‌ خود به نوسان در آید، ساکن می‌شود.
broader: میرایی
preferred label: aperiodic damping @en
type: Concept

میرایی
preferred label: damping @en
type: Concept
narrower: میرایی نادوره‌ای