اصطکاک
preferred label: friction @en
type: Concept
narrower: اصطکاک جنبشی

اصطکاک جنبشی
scope note: اصطکاک بین دو سطحِ درحال‌لغزش نسبت به یکدیگر
broader: اصطکاک
preferred label: kinetic friction @en
type: Concept