اصطکاک
preferred label: friction @en
type: Concept
narrower: اصطکاک لغزشی

اصطکاک لغزشی
scope note: نیروی اصطکاک بین دو سطحی که بر روی هم می‌لغزند.
broader: اصطکاک
preferred label: sliding friction @en
type: Concept