اصطکاک کشندی
scope note: اصطکاک ناشی از موج کِشَندی به‌ویژه در بستر آب‌های کم‌عمق
broader: اصطکاک
preferred label: tidal friction @en
type: Concept

اصطکاک
preferred label: friction @en
type: Concept
narrower: اصطکاک کشندی