پسار
preferred label: drag @en
type: Concept
narrower: پسار فشاری

پسار فشاری
scope note: پسار ناشی از مجموع تمامی نیروهای واردشده بر سطح در جهت جریان هوا
broader: پسار
preferred label: pressure drag @en
type: Concept