پسار نیم‌رخی
preferred label: profile drag @en
type: Concept
narrower: پسار نیم‌رخی مؤثر

پسار نیم‌رخی مؤثر
scope note: اختلاف بین پسار کل بال و پسار القایی آن با همان نسبت منظری، اما با توزیع بار بیضوی بر روی بال
broader: پسار نیم‌رخی
preferred label: effective profile drag @en
type: Concept