پسار کل
scope note: مؤلفۀ برآیند نیروهای آئرودینامیکی واردشده بر جسم بی‌مجرا در جهت جریان هوا
broader: پسار
preferred label: total drag @en
type: Concept

پسار
preferred label: drag @en
type: Concept
narrower: پسار کل