پسار بادچرخی
scope note: پسار اضافه‌ای که ملخ در حال بادچرخی تولید می‌کند.
broader: پسار
preferred label: windmilling drag @en
type: Concept

پسار
preferred label: drag @en
type: Concept
narrower: پسار بادچرخی