تلاطم
preferred label: turbulence @en
type: Concept
narrower: تلاطم پسایه

تلاطم پسایه
scope note: آشفتگی‌ای که پس از عبور هواگَرد در هوا باقی می‌ماند.
related: هواگرد
broader: تلاطم
preferred label: wake turbulence @en
type: Concept

هواگرد
preferred label: aircraft @en
type: Concept
related: تلاطم پسایه