مکانیک مولکولی
scope note: روش تجربی محاسبۀ پویایی‌شناسی مولکولی که در آن پیوندهای میان اتم‌ها به شکل فنرهایی مطابق با قانون هوک (Hooke's law) نمایش داده می‌شود.
related: قانون هوک
broader: مکانیک
preferred label: molecular mechanics @en
type: Concept

قانون هوک
preferred label: Hooke's law @en
type: Concept
related: مکانیک مولکولی

مکانیک
preferred label: mechanics @en
type: Concept
narrower: مکانیک مولکولی