طب اعتیاد
alternative label: اعتیادپزشکی
scope note: شاخه‌ای از پزشکی که به درمان و بازتوانبخشی معتادان به مواد و الکل می‌پردازد.
broader: دانش پزشکی
preferred label: addiction medicine @en
type: Concept

دانش پزشکی
preferred label: medicine @en
type: Concept
narrower: طب اعتیاد