فضاپیما
preferred label: spacecraft @en
type: Concept
related: پزشکی هوافضا

دانش پزشکی
preferred label: medicine @en
type: Concept
narrower: پزشکی هوافضا

پزشکی هوافضا
scope note: شاخه‌ای از علم پزشکی که به مطالعۀ تغییرات و اختلالات وسایل کاراندام‌شناختی ناشی از حرکت در فضا می‌پردازد.
related: فضاپیما
broader: دانش پزشکی
preferred label: aerospace medicine @en
type: Concept