پزشکی شواهدبنیاد
scope note: پزشکی مبتنی بر شناسایی و ارزیابی و به‌کارگیری روش‌های تشخیصی و درمانی براساس بهترین شیوه‌های موجود و دستاوردهای تحقیقاتی و تجارب بالینی با توجه به نیاز و ترجیح بیمار
broader: دانش پزشکی
preferred label: evidence-based medicine @en
type: Concept

دانش پزشکی
preferred label: medicine @en
type: Concept
narrower: پزشکی شواهدبنیاد