دانش پزشکی
preferred label: medicine @en
type: Concept
narrower: طب گیاهی

طب گیاهی
alternative label: پزشکی گیاهی
scope note: نوعی نظام درمان‍ی که در آن منحصراً از داروها و فراورده‌های گیاهی استفاده می‌شود.
broader: دانش پزشکی
preferred label: herbal medicine @en
type: Concept