دانش پزشکی
preferred label: medicine @en
type: Concept
narrower: طبیعت‌درمانی

طبیعت‌درمانی
scope note: نوعی روش درمان مبتنی ‌بر استفاده از غذاهای طبیعی و نور و هوای پاک و ورزش و پرهیز از مصرف دارو
broader: دانش پزشکی
preferred label: naturopathy @en
type: Concept