ریخته‌گری فلز
preferred label: metal casting @en
type: Concept
narrower: ریخته‌گری توپر

ریخته‌گری توپر
scope note: یکی از روش‌های ریخته‌گری که در آن از مدل‌های اسفنجی یا پلی‌استیرن استفاده می‌شود و قبل از بارریزی یا همراه با بارریزی، مدل تبخیر و از قالب خارج می‌شود.
broader: ریخته‌گری فلز
preferred label: full mould casting @en
type: Concept