ریخته‌گری وزنی
scope note: یکی از روش‌های ریخته‌گری که در آن فلز مذاب به علت وزن خود، قالب ماسه‌ای یا فلزی را پر می‌کند.
broader: ریخته‌گری فلز
preferred label: gravity casting @en
type: Concept

ریخته‌گری فلز
preferred label: metal casting @en
type: Concept
narrower: ریخته‌گری وزنی