پادتن
preferred label: antibody @en
type: Concept
narrower: پادتن حبه‌ای

پادتن حبه‌ای
scope note: تکه‌ای از پادتن به‌ طول حدوداً 110 آمینواسیدی که دستکاری شده تا بتواند فقط شامل اولین حلقۀ پپتیدی حبۀ زنجیرۀ سنگین (ناحیۀ VH) و نیز زنجیرۀ سبک (ناحیۀ VL) باشد، اما همچنان به پادگن همخوان متصل بماند.
broader: پادتن
preferred label: domain antibody @en
type: Concept