ریزاندامگان
preferred label: microorganism @en
type: Concept
narrower: ریزاندامگان اسیدپای

ریزاندامگان اسیدپای
scope note: ریزاندامگانی که قادر به تحمل محیط اسیدی است.
broader: ریزاندامگان
preferred label: aciduric microorganism @en
type: Concept