ویروس
preferred label: virus @en
type: Concept
narrower: ویروس ناقص

ویروس ناقص
scope note: ویروسی که به علت نارسایی ژنتیکی یا نداشتن عوامل مورد نیاز قادر به تکثیر نیست.
broader: ویروس
preferred label: defective virus @en
type: Concept